Не работает Wi-Fi адаптер TP-Link Archer T1U

И прочие интерфейсы передачи данных
Правила форума
Как правильно задавать вопросы Правильно сформулированный вопрос и его грамотное оформление способствует высокой вероятности получения достаточно содержательного и по существу ответа. Общая рекомендация по составлению тем: 1. Версия ОС вместе с разрядностью. Пример: LM 18.1 x64, LM Sarah x32 2. DE. Если вопрос касается двух, то через запятую. (xfce, KDE, cinnamon, mate) 3. Какое железо. (достаточно вывод inxi -Fxz в спойлере (как пользоваться спойлером смотрим здесь)) или же дать ссылку на hw-probe 4. Суть. Желательно с выводом консоли, логами. 5. Скрин. Просьба указывать 1, 2 и 3 независимо от того, имеет ли это отношение к вопросу или нет. Так же не забываем об общих правилах Как пример вот

Автор темы
sergio
Сообщения: 16
Зарегистрирован: 17 янв 2018, 05:50
Благодарил (а): 4 раза

Не работает Wi-Fi адаптер TP-Link Archer T1U

Сообщение sergio » 17 янв 2018, 06:46

Всем добрый день! Возникла идея обеспечить свой системный блок Wi-Fi. Купил адаптер TP-Link Archer T1U, но столкнулся с проблемой установки драйвера. На официальном сайте есть на линукс драйвер, однако указано что работает с версией ядра Linux (Kernel version 2.6~3.16). В моём дистрибутиве версия ядра ушла за индекс 4 (4.13.0-26-generic x86_64 Linux Mint 18.3 Sylvia). Кто-нибудь сталкивался с подобным девайсом? Есть решение проблемы запуска? Буду рад помощи! :blush:
sergio@sergio-MS-7996 ~ $ lsusb
Bus 002 Device 001: ID 1d6b:0003 Linux Foundation 3.0 root hub
Bus 001 Device 004: ID 04d9:a09f Holtek Semiconductor, Inc.
Bus 001 Device 003: ID 0a12:0001 Cambridge Silicon Radio, Ltd Bluetooth Dongle (HCI mode)
Bus 001 Device 002: ID 2357:0105
Bus 001 Device 001: ID 1d6b:0002 Linux Foundation 2.0 root hub

sergio@sergio-MS-7996 ~ $ inxi -Fxz
System: Host: sergio-MS-7996 Kernel: 4.13.0-26-generic x86_64 (64 bit gcc: 5.4.0)
Desktop: Cinnamon 3.6.7 (Gtk 3.18.9-1ubuntu3.3)
Distro: Linux Mint 18.3 Sylvia
Machine: Mobo: MSI model: H110M PRO-D (MS-7996) v: 1.0
Bios: American Megatrends v: 2.E0 date: 08/11/2017
CPU: Quad core Intel Core i5-6400 (-MCP-) cache: 6144 KB
flags: (lm nx sse sse2 sse3 sse4_1 sse4_2 ssse3 vmx) bmips: 21696
clock speeds: max: 3300 MHz 1: 2700 MHz 2: 2700 MHz 3: 2700 MHz
4: 2700 MHz
Graphics: Card: NVIDIA Device 1c02 bus-ID: 01:00.0
Display Server: X.Org 1.18.4 drivers: nvidia (unloaded: fbdev,vesa,nouveau)
Resolution: 1280x1024@60.02hz
GLX Renderer: GeForce GTX 1060 3GB/PCIe/SSE2
GLX Version: 4.5.0 NVIDIA 384.111 Direct Rendering: Yes
Audio: Card-1 NVIDIA Device 10f1 driver: snd_hda_intel bus-ID: 01:00.1
Card-2 Intel Sunrise Point-H HD Audio
driver: snd_hda_intel bus-ID: 00:1f.3
Sound: Advanced Linux Sound Architecture v: k4.13.0-26-generic
Network: Card: Realtek RTL8111/8168/8411 PCI Express Gigabit Ethernet Controller
driver: r8169 v: 2.3LK-NAPI port: d000 bus-ID: 02:00.0
IF: enp2s0 state: up speed: 100 Mbps duplex: full mac: <filter>
Drives: HDD Total Size: 1370.3GB (1.3% used)
ID-1: /dev/sda model: Samsung_SSD_750 size: 120.0GB
ID-2: /dev/sdb model: ST1000DM003 size: 1000.2GB
ID-3: /dev/sdc model: WDC_WD2500AAKX size: 250.1GB
Partition: ID-1: / size: 102G used: 9.3G (10%) fs: ext4 dev: /dev/sda2
ID-2: swap-1 size: 8.55GB used: 0.00GB (0%) fs: swap dev: /dev/sda3
RAID: No RAID devices: /proc/mdstat, md_mod kernel module present
Sensors: System Temperatures: cpu: 48.0C mobo: 29.8C gpu: 0.0:45C
Fan Speeds (in rpm): cpu: N/A
Info: Processes: 203 Uptime: 47 min Memory: 1562.5/7939.6MB
Init: systemd runlevel: 5 Gcc sys: 5.4.0
Client: Shell (bash 4.3.481) inxi: 2.2.35

sergio@sergio-MS-7996 ~ $ iwconfig
lo no wireless extensions.

enp2s0 no wireless extensions.

Аватара пользователя

Я_Максим
Сообщения: 164
Зарегистрирован: 10 ноя 2017, 16:25
Благодарил (а): 29 раз

Не работает Wi-Fi адаптер TP-Link Archer T1U

Сообщение Я_Максим » 17 янв 2018, 06:48

вы пробовали устанавливать драйвер?
FX-8350 тащит

Аватара пользователя

Unborn
Сообщения: 1775
Зарегистрирован: 03 сен 2016, 10:36
Решено: 24
Благодарил (а): 4 раза
Поблагодарили: 252 раза

Не работает Wi-Fi адаптер TP-Link Archer T1U

Сообщение Unborn » 17 янв 2018, 07:01

sergio, http://forum.ubuntu.ru/index.php?topic=281498.0
Х.з. как с ядром 4.13, но всегда с исходников можно попробовать.


Автор темы
sergio
Сообщения: 16
Зарегистрирован: 17 янв 2018, 05:50
Благодарил (а): 4 раза

Не работает Wi-Fi адаптер TP-Link Archer T1U

Сообщение sergio » 17 янв 2018, 10:13

Я_Максим, пробовал, но выхлопа никакого. Набирал те команды, что были в инструкции и ничего.


Автор темы
sergio
Сообщения: 16
Зарегистрирован: 17 янв 2018, 05:50
Благодарил (а): 4 раза

Не работает Wi-Fi адаптер TP-Link Archer T1U

Сообщение sergio » 17 янв 2018, 10:14

Unborn, я подобное никогда не делал. Может где есть инструкция как это делается? Хотя бы принцип понять.

Аватара пользователя

darkfenix
Сообщения: 5042
Зарегистрирован: 27 июн 2017, 10:36
Решено: 58
Откуда: Нижний Тагил
Благодарил (а): 286 раз
Поблагодарили: 942 раза

Не работает Wi-Fi адаптер TP-Link Archer T1U

Сообщение darkfenix » 17 янв 2018, 10:28

Попробуй так

Код: Выделить всё

wget https://dl.dropboxusercontent.com/u/80256631/mt7610-4.1.7-817.tar.gz
tar xzf mt7610-4.1.7-817.tar.gz
./install.sh
Взято тут
Изображение

В сети
Аватара пользователя

Chocobo
Сообщения: 9119
Зарегистрирован: 27 авг 2016, 19:57
Решено: 198
Откуда: НН
Благодарил (а): 635 раз
Поблагодарили: 2609 раз

Не работает Wi-Fi адаптер TP-Link Archer T1U

Сообщение Chocobo » 17 янв 2018, 10:39

darkfenix, стухла ссылка :sad:

Код: Выделить всё

HTTP-запрос отправлен. Ожидание ответа... 404 Not Found
А ТС все же стоит попробовать собрать дровину с офсайта. То что его не тестили на ядрах выше 3.16 - не значит что оно работать не будет :)
Изображение
   
Изображение

Аватара пользователя

darkfenix
Сообщения: 5042
Зарегистрирован: 27 июн 2017, 10:36
Решено: 58
Откуда: Нижний Тагил
Благодарил (а): 286 раз
Поблагодарили: 942 раза

Не работает Wi-Fi адаптер TP-Link Archer T1U

Сообщение darkfenix » 17 янв 2018, 10:52

Можно попробовать это собрать. Пишут что есть поддержка ядра 4.7
Изображение

Аватара пользователя

Unborn
Сообщения: 1775
Зарегистрирован: 03 сен 2016, 10:36
Решено: 24
Благодарил (а): 4 раза
Поблагодарили: 252 раза

Не работает Wi-Fi адаптер TP-Link Archer T1U

Сообщение Unborn » 17 янв 2018, 11:27

sergio писал(а):
17 янв 2018, 10:14
Может где есть инструкция как это делается? Хотя бы принцип понять.
Ты mt7610u-dkms пробовал установить? Что получилось?
Есть ещё универсальный rtl8812au-dkms
Chocobo писал(а):
17 янв 2018, 10:39
о что его не тестили на ядрах выше 3.16 - не значит что оно работать не будет :)
С WEP может и будет работать. С WPA/WPA2 нет.


Автор темы
sergio
Сообщения: 16
Зарегистрирован: 17 янв 2018, 05:50
Благодарил (а): 4 раза

Не работает Wi-Fi адаптер TP-Link Archer T1U

Сообщение sergio » 17 янв 2018, 17:42

Друзья, спасибо за советы. Я попробую всё это обкурить и сделать.

Аватара пользователя

darkfenix
Сообщения: 5042
Зарегистрирован: 27 июн 2017, 10:36
Решено: 58
Откуда: Нижний Тагил
Благодарил (а): 286 раз
Поблагодарили: 942 раза

Не работает Wi-Fi адаптер TP-Link Archer T1U

Сообщение darkfenix » 18 янв 2018, 03:37

Не по теме
sergio писал(а):
17 янв 2018, 17:42
Я попробую всё это обкурить
Ты с этим осторожней, а то последствия разные бывают :crazy: :-D
Изображение


Автор темы
sergio
Сообщения: 16
Зарегистрирован: 17 янв 2018, 05:50
Благодарил (а): 4 раза

Не работает Wi-Fi адаптер TP-Link Archer T1U

Сообщение sergio » 19 янв 2018, 06:51

Попробовал выполнить так как написано тут http://hprath.com/2014/06/cisco-linksys ... ver-patch/. Но не помогло.
sergio@sergio-MS-7996 ~/mediatek_mt7610u_sta_driver_linux-64bit $ make clean
cp -f os/linux/Makefile.clean os/linux/Makefile
make -C os/linux clean
make[1]: вход в каталог «/home/sergio/mediatek_mt7610u_sta_driver_linux-64bit/os/linux»
rm -f ../../common/*.o
rm -f ../../common/.*.cmd .*.flags .*.d
rm -f ../../os/linux/*.o *.ko *.mod.o *.mod.c
rm -f ../../os/linux/.*.cmd .*.flags .*.d
rm -fr ../../os/linux/.tmp_versions
rm -f ../../os/linux/Module.symvers
rm -f ../../os/linux/Modules.symvers
rm -f ../../os/linux/Module.markers
rm -f ../../os/linux/modules.order
rm -f ../../chips/*.o
rm -f ../../chips/.*.cmd .*.flags .*.d
rm -f ../../rate_ctrl/*.o
rm -f ../../rate_ctrl/.*.cmd .*.flags .*.d
rm -f ../../ate/common/*.o
rm -f ../../ate/common/.*.cmd .*.flags .*.d
rm -f ../../ate/chips/*.o
rm -f ../../ate/chips/.*.cmd .*.flags .*.d
rm -f ../../phy/*.o
rm -f ../../phy/.*.cmd .*.flags .*.d
rm -f ../../mac/*.o
rm -f ../../mac/.*.cmd .*.flags .*.d
rm -f ../../mcu/*.o
rm -f ../../mcu/.*.cmd .*.flags .*.d
rm -f ../../mgmt/*.o
rm -f ../../mgmt/.*.cmd .*.flags .*.d
rm -f ../../naf/*.o
rm -f ../../naf/.*.cmd .*.flags .*.d
rm -f ../../sta/*.o
rm -f ../../sta/.*.cmd .*.flags .*.d
make[1]: выход из каталога «/home/sergio/mediatek_mt7610u_sta_driver_linux-64bit/os/linux»
rm -rf os/linux/Makefile
sergio@sergio-MS-7996 ~/mediatek_mt7610u_sta_driver_linux-64bit $ make
make -C tools
make[1]: вход в каталог «/home/sergio/mediatek_mt7610u_sta_driver_linux-64bit/tools»
gcc -g bin2h.c -o bin2h
make[1]: выход из каталога «/home/sergio/mediatek_mt7610u_sta_driver_linux-64bit/tools»
/home/sergio/mediatek_mt7610u_sta_driver_linux-64bit/tools/bin2h
chipset = mt7610u
cp -f os/linux/Makefile.6 /home/sergio/mediatek_mt7610u_sta_driver_linux-64bit/os/linux/Makefile
make -C /lib/modules/4.13.0-26-generic/build SUBDIRS=/home/sergio/mediatek_mt7610u_sta_driver_linux-64bit/os/linux modules
make[1]: вход в каталог «/usr/src/linux-headers-4.13.0-26-generic»
CC [M] /home/sergio/mediatek_mt7610u_sta_driver_linux-64bit/os/linux/../../os/linux/rt_profile.o
/home/sergio/mediatek_mt7610u_sta_driver_linux-64bit/os/linux/../../os/linux/rt_profile.c: In function ‘announce_802_3_packet’:
/home/sergio/mediatek_mt7610u_sta_driver_linux-64bit/os/linux/../../os/linux/rt_profile.c:334:16: warning: unused variable ‘pAd’ [-Wunused-variable]
RTMP_ADAPTER *pAd = (RTMP_ADAPTER *)pAdSrc;
^
In file included from /home/sergio/mediatek_mt7610u_sta_driver_linux-64bit/include/rtmp_os.h:44:0,
from /home/sergio/mediatek_mt7610u_sta_driver_linux-64bit/include/rtmp_comm.h:75,
from /home/sergio/mediatek_mt7610u_sta_driver_linux-64bit/include/rt_config.h:33,
from /home/sergio/mediatek_mt7610u_sta_driver_linux-64bit/os/linux/../../os/linux/rt_profile.c:28:
/home/sergio/mediatek_mt7610u_sta_driver_linux-64bit/os/linux/../../os/linux/rt_profile.c: In function ‘STA_MonPktSend’:
/home/sergio/mediatek_mt7610u_sta_driver_linux-64bit/os/linux/../../os/linux/rt_profile.c:443:35: warning: format ‘%d’ expects argument of type ‘int’, but argument 3 has type ‘long unsigned int’ [-Wformat=]
DBGPRINT(RT_DEBUG_ERROR, ("%s : Size is too large! (%d)\n", __FUNCTION_
^
/home/sergio/mediatek_mt7610u_sta_driver_linux-64bit/include/os/rt_linux.h:660:16: note: in definition of macro ‘DBGPRINT_RAW’
printk Fmt; \
^
/home/sergio/mediatek_mt7610u_sta_driver_linux-64bit/os/linux/../../os/linux/rt_profile.c:443:9: note: in expansion of macro ‘DBGPRINT’
DBGPRINT(RT_DEBUG_ERROR, ("%s : Size is too large! (%d)\n", __FUNCTION_
^
CC [M] /home/sergio/mediatek_mt7610u_sta_driver_linux-64bit/os/linux/../../sta/assoc.o
CC [M] /home/sergio/mediatek_mt7610u_sta_driver_linux-64bit/os/linux/../../sta/auth.o
CC [M] /home/sergio/mediatek_mt7610u_sta_driver_linux-64bit/os/linux/../../sta/auth_rsp.o
CC [M] /home/sergio/mediatek_mt7610u_sta_driver_linux-64bit/os/linux/../../sta/sync.o
CC [M] /home/sergio/mediatek_mt7610u_sta_driver_linux-64bit/os/linux/../../sta/sanity.o
CC [M] /home/sergio/mediatek_mt7610u_sta_driver_linux-64bit/os/linux/../../sta/rtmp_data.o
CC [M] /home/sergio/mediatek_mt7610u_sta_driver_linux-64bit/os/linux/../../sta/connect.o
CC [M] /home/sergio/mediatek_mt7610u_sta_driver_linux-64bit/os/linux/../../sta/wpa.o
CC [M] /home/sergio/mediatek_mt7610u_sta_driver_linux-64bit/os/linux/../../sta/sta_cfg.o
CC [M] /home/sergio/mediatek_mt7610u_sta_driver_linux-64bit/os/linux/../../mgmt/mgmt_vht.o
CC [M] /home/sergio/mediatek_mt7610u_sta_driver_linux-64bit/os/linux/../../common/vht.o
CC [M] /home/sergio/mediatek_mt7610u_sta_driver_linux-64bit/os/linux/../../common/crypt_md5.o
CC [M] /home/sergio/mediatek_mt7610u_sta_driver_linux-64bit/os/linux/../../common/crypt_sha2.o
CC [M] /home/sergio/mediatek_mt7610u_sta_driver_linux-64bit/os/linux/../../common/crypt_hmac.o
CC [M] /home/sergio/mediatek_mt7610u_sta_driver_linux-64bit/os/linux/../../common/crypt_aes.o
In file included from /home/sergio/mediatek_mt7610u_sta_driver_linux-64bit/include/rtmp_os.h:44:0,
from /home/sergio/mediatek_mt7610u_sta_driver_linux-64bit/include/rtmp_comm.h:75,
from /home/sergio/mediatek_mt7610u_sta_driver_linux-64bit/include/rt_config.h:33,
from /home/sergio/mediatek_mt7610u_sta_driver_linux-64bit/include/crypt_aes.h:31,
from /home/sergio/mediatek_mt7610u_sta_driver_linux-64bit/os/linux/../../common/crypt_aes.c:28:
/home/sergio/mediatek_mt7610u_sta_driver_linux-64bit/os/linux/../../common/crypt_aes.c: In function ‘AES_Key_Wrap’:
/home/sergio/mediatek_mt7610u_sta_driver_linux-64bit/os/linux/../../common/crypt_aes.c:1459:32: warning: format ‘%d’ expects argument of type ‘int’, but argument 2 has type ‘long unsigned int’ [-Wformat=]
DBGPRINT(RT_DEBUG_ERROR, ("AES_Key_Wrap: allocate %d bytes memory failure.
^
/home/sergio/mediatek_mt7610u_sta_driver_linux-64bit/include/os/rt_linux.h:660:16: note: in definition of macro ‘DBGPRINT_RAW’
printk Fmt; \
^
/home/sergio/mediatek_mt7610u_sta_driver_linux-64bit/os/linux/../../common/crypt_aes.c:1459:6: note: in expansion of macro ‘DBGPRINT’
DBGPRINT(RT_DEBUG_ERROR, ("AES_Key_Wrap: allocate %d bytes memory failure.
^
/home/sergio/mediatek_mt7610u_sta_driver_linux-64bit/os/linux/../../common/crypt_aes.c: In function ‘AES_Key_Unwrap’:
/home/sergio/mediatek_mt7610u_sta_driver_linux-64bit/os/linux/../../common/crypt_aes.c:1554:32: warning: format ‘%d’ expects argument of type ‘int’, but argument 2 has type ‘long unsigned int’ [-Wformat=]
DBGPRINT(RT_DEBUG_ERROR, ("AES_Key_Unwrap: allocate %d bytes memory failur
^
/home/sergio/mediatek_mt7610u_sta_driver_linux-64bit/include/os/rt_linux.h:660:16: note: in definition of macro ‘DBGPRINT_RAW’
printk Fmt; \
^
/home/sergio/mediatek_mt7610u_sta_driver_linux-64bit/os/linux/../../common/crypt_aes.c:1554:6: note: in expansion of macro ‘DBGPRINT’
DBGPRINT(RT_DEBUG_ERROR, ("AES_Key_Unwrap: allocate %d bytes memory failur
^
CC [M] /home/sergio/mediatek_mt7610u_sta_driver_linux-64bit/os/linux/../../common/crypt_arc4.o
CC [M] /home/sergio/mediatek_mt7610u_sta_driver_linux-64bit/os/linux/../../common/mlme.o
CC [M] /home/sergio/mediatek_mt7610u_sta_driver_linux-64bit/os/linux/../../common/cmm_wep.o
CC [M] /home/sergio/mediatek_mt7610u_sta_driver_linux-64bit/os/linux/../../common/action.o
CC [M] /home/sergio/mediatek_mt7610u_sta_driver_linux-64bit/os/linux/../../common/cmm_data.o
CC [M] /home/sergio/mediatek_mt7610u_sta_driver_linux-64bit/os/linux/../../common/rtmp_init.o
In file included from /home/sergio/mediatek_mt7610u_sta_driver_linux-64bit/include/rtmp_os.h:44:0,
from /home/sergio/mediatek_mt7610u_sta_driver_linux-64bit/include/rtmp_comm.h:75,
from /home/sergio/mediatek_mt7610u_sta_driver_linux-64bit/include/rt_config.h:33,
from /home/sergio/mediatek_mt7610u_sta_driver_linux-64bit/os/linux/../../common/rtmp_init.c:28:
/home/sergio/mediatek_mt7610u_sta_driver_linux-64bit/os/linux/../../common/rtmp_init.c: In function ‘NICReadEEPROMParameters’:
/home/sergio/mediatek_mt7610u_sta_driver_linux-64bit/os/linux/../../common/rtmp_init.c:716:28: warning: format ‘%d’ expects argument of type ‘int’, but argument 2 has type ‘UCHAR * {aka unsigned char *}’ [-Wformat=]
DBGPRINT(RT_DEBUG_TRACE,("E2PROM: A Tssi[-4 .. +4] = %d %d %d %d - %d -%d %d
^
/home/sergio/mediatek_mt7610u_sta_driver_linux-64bit/include/os/rt_linux.h:660:16: note: in definition of macro ‘DBGPRINT_RAW’
printk Fmt; \
^
/home/sergio/mediatek_mt7610u_sta_driver_linux-64bit/os/linux/../../common/rtmp_init.c:716:3: note: in expansion of macro ‘DBGPRINT’
DBGPRINT(RT_DEBUG_TRACE,("E2PROM: A Tssi[-4 .. +4] = %d %d %d %d - %d -%d %d
^
/home/sergio/mediatek_mt7610u_sta_driver_linux-64bit/os/linux/../../common/rtmp_init.c:716:28: warning: format ‘%d’ expects argument of type ‘int’, but argument 3 has type ‘UCHAR * {aka unsigned char *}’ [-Wformat=]
DBGPRINT(RT_DEBUG_TRACE,("E2PROM: A Tssi[-4 .. +4] = %d %d %d %d - %d -%d %d
^
/home/sergio/mediatek_mt7610u_sta_driver_linux-64bit/include/os/rt_linux.h:660:16: note: in definition of macro ‘DBGPRINT_RAW’
printk Fmt; \
^
/home/sergio/mediatek_mt7610u_sta_driver_linux-64bit/os/linux/../../common/rtmp_init.c:716:3: note: in expansion of macro ‘DBGPRINT’
DBGPRINT(RT_DEBUG_TRACE,("E2PROM: A Tssi[-4 .. +4] = %d %d %d %d - %d -%d %d
^
/home/sergio/mediatek_mt7610u_sta_driver_linux-64bit/os/linux/../../common/rtmp_init.c:716:28: warning: format ‘%d’ expects argument of type ‘int’, but argument 4 has type ‘UCHAR * {aka unsigned char *}’ [-Wformat=]
DBGPRINT(RT_DEBUG_TRACE,("E2PROM: A Tssi[-4 .. +4] = %d %d %d %d - %d -%d %d
^
/home/sergio/mediatek_mt7610u_sta_driver_linux-64bit/include/os/rt_linux.h:660:16: note: in definition of macro ‘DBGPRINT_RAW’
printk Fmt; \
^
/home/sergio/mediatek_mt7610u_sta_driver_linux-64bit/os/linux/../../common/rtmp_init.c:716:3: note: in expansion of macro ‘DBGPRINT’
DBGPRINT(RT_DEBUG_TRACE,("E2PROM: A Tssi[-4 .. +4] = %d %d %d %d - %d -%d %d
^
/home/sergio/mediatek_mt7610u_sta_driver_linux-64bit/os/linux/../../common/rtmp_init.c:716:28: warning: format ‘%d’ expects argument of type ‘int’, but argument 5 has type ‘UCHAR * {aka unsigned char *}’ [-Wformat=]
DBGPRINT(RT_DEBUG_TRACE,("E2PROM: A Tssi[-4 .. +4] = %d %d %d %d - %d -%d %d
^
/home/sergio/mediatek_mt7610u_sta_driver_linux-64bit/include/os/rt_linux.h:660:16: note: in definition of macro ‘DBGPRINT_RAW’
printk Fmt; \
^
/home/sergio/mediatek_mt7610u_sta_driver_linux-64bit/os/linux/../../common/rtmp_init.c:716:3: note: in expansion of macro ‘DBGPRINT’
DBGPRINT(RT_DEBUG_TRACE,("E2PROM: A Tssi[-4 .. +4] = %d %d %d %d - %d -%d %d
^
/home/sergio/mediatek_mt7610u_sta_driver_linux-64bit/os/linux/../../common/rtmp_init.c:716:28: warning: format ‘%d’ expects argument of type ‘int’, but argument 7 has type ‘UCHAR * {aka unsigned char *}’ [-Wformat=]
DBGPRINT(RT_DEBUG_TRACE,("E2PROM: A Tssi[-4 .. +4] = %d %d %d %d - %d -%d %d
^
/home/sergio/mediatek_mt7610u_sta_driver_linux-64bit/include/os/rt_linux.h:660:16: note: in definition of macro ‘DBGPRINT_RAW’
printk Fmt; \
^
/home/sergio/mediatek_mt7610u_sta_driver_linux-64bit/os/linux/../../common/rtmp_init.c:716:3: note: in expansion of macro ‘DBGPRINT’
DBGPRINT(RT_DEBUG_TRACE,("E2PROM: A Tssi[-4 .. +4] = %d %d %d %d - %d -%d %d
^
/home/sergio/mediatek_mt7610u_sta_driver_linux-64bit/os/linux/../../common/rtmp_init.c:716:28: warning: format ‘%d’ expects argument of type ‘int’, but argument 8 has type ‘UCHAR * {aka unsigned char *}’ [-Wformat=]
DBGPRINT(RT_DEBUG_TRACE,("E2PROM: A Tssi[-4 .. +4] = %d %d %d %d - %d -%d %d
^
/home/sergio/mediatek_mt7610u_sta_driver_linux-64bit/include/os/rt_linux.h:660:16: note: in definition of macro ‘DBGPRINT_RAW’
printk Fmt; \
^
/home/sergio/mediatek_mt7610u_sta_driver_linux-64bit/os/linux/../../common/rtmp_init.c:716:3: note: in expansion of macro ‘DBGPRINT’
DBGPRINT(RT_DEBUG_TRACE,("E2PROM: A Tssi[-4 .. +4] = %d %d %d %d - %d -%d %d
^
/home/sergio/mediatek_mt7610u_sta_driver_linux-64bit/os/linux/../../common/rtmp_init.c:716:28: warning: format ‘%d’ expects argument of type ‘int’, but argument 9 has type ‘UCHAR * {aka unsigned char *}’ [-Wformat=]
DBGPRINT(RT_DEBUG_TRACE,("E2PROM: A Tssi[-4 .. +4] = %d %d %d %d - %d -%d %d
^
/home/sergio/mediatek_mt7610u_sta_driver_linux-64bit/include/os/rt_linux.h:660:16: note: in definition of macro ‘DBGPRINT_RAW’
printk Fmt; \
^
/home/sergio/mediatek_mt7610u_sta_driver_linux-64bit/os/linux/../../common/rtmp_init.c:716:3: note: in expansion of macro ‘DBGPRINT’
DBGPRINT(RT_DEBUG_TRACE,("E2PROM: A Tssi[-4 .. +4] = %d %d %d %d - %d -%d %d
^
/home/sergio/mediatek_mt7610u_sta_driver_linux-64bit/os/linux/../../common/rtmp_init.c:716:28: warning: format ‘%d’ expects argument of type ‘int’, but argument 10 has type ‘UCHAR * {aka unsigned char *}’ [-Wformat=]
DBGPRINT(RT_DEBUG_TRACE,("E2PROM: A Tssi[-4 .. +4] = %d %d %d %d - %d -%d %d
^
/home/sergio/mediatek_mt7610u_sta_driver_linux-64bit/include/os/rt_linux.h:660:16: note: in definition of macro ‘DBGPRINT_RAW’
printk Fmt; \
^
/home/sergio/mediatek_mt7610u_sta_driver_linux-64bit/os/linux/../../common/rtmp_init.c:716:3: note: in expansion of macro ‘DBGPRINT’
DBGPRINT(RT_DEBUG_TRACE,("E2PROM: A Tssi[-4 .. +4] = %d %d %d %d - %d -%d %d
^
/home/sergio/mediatek_mt7610u_sta_driver_linux-64bit/os/linux/../../common/rtmp_init.c: In function ‘NICInitAsicFromEEPROM’:
/home/sergio/mediatek_mt7610u_sta_driver_linux-64bit/os/linux/../../common/rtmp_init.c:1061:9: warning: unused variable ‘i’ [-Wunused-variable]
USHORT i;
^
/home/sergio/mediatek_mt7610u_sta_driver_linux-64bit/os/linux/../../common/rtmp_init.c: In function ‘NICInitializeAsic’:
/home/sergio/mediatek_mt7610u_sta_driver_linux-64bit/os/linux/../../common/rtmp_init.c:1684:1: warning: the frame size of 2056 bytes is larger than 1024 bytes [-Wframe-larger-than=]
}
^
In file included from /home/sergio/mediatek_mt7610u_sta_driver_linux-64bit/include/rtmp_os.h:44:0,
from /home/sergio/mediatek_mt7610u_sta_driver_linux-64bit/include/rtmp_comm.h:75,
from /home/sergio/mediatek_mt7610u_sta_driver_linux-64bit/include/rt_config.h:33,
from /home/sergio/mediatek_mt7610u_sta_driver_linux-64bit/os/linux/../../common/rtmp_init.c:28:
/home/sergio/mediatek_mt7610u_sta_driver_linux-64bit/os/linux/../../common/rtmp_init.c: In function ‘NICReadEEPROMParameters’:
/home/sergio/mediatek_mt7610u_sta_driver_linux-64bit/include/os/rt_linux.h:660:9: warning: array subscript is above array bounds [-Warray-bounds]
printk Fmt; \
^
/home/sergio/mediatek_mt7610u_sta_driver_linux-64bit/include/os/rt_linux.h:664:33: note: in expansion of macro ‘DBGPRINT_RAW’
#define DBGPRINT(Level, Fmt) DBGPRINT_RAW(Level, Fmt)
^
/home/sergio/mediatek_mt7610u_sta_driver_linux-64bit/os/linux/../../common/rtmp_init.c:716:3: note: in expansion of macro ‘DBGPRINT’
DBGPRINT(RT_DEBUG_TRACE,("E2PROM: A Tssi[-4 .. +4] = %d %d %d %d - %d -%d %d
^
/home/sergio/mediatek_mt7610u_sta_driver_linux-64bit/include/os/rt_linux.h:660:9: warning: array subscript is above array bounds [-Warray-bounds]
printk Fmt; \
^
/home/sergio/mediatek_mt7610u_sta_driver_linux-64bit/include/os/rt_linux.h:664:33: note: in expansion of macro ‘DBGPRINT_RAW’
#define DBGPRINT(Level, Fmt) DBGPRINT_RAW(Level, Fmt)
^
/home/sergio/mediatek_mt7610u_sta_driver_linux-64bit/os/linux/../../common/rtmp_init.c:716:3: note: in expansion of macro ‘DBGPRINT’
DBGPRINT(RT_DEBUG_TRACE,("E2PROM: A Tssi[-4 .. +4] = %d %d %d %d - %d -%d %d
^
/home/sergio/mediatek_mt7610u_sta_driver_linux-64bit/include/os/rt_linux.h:660:9: warning: array subscript is above array bounds [-Warray-bounds]
printk Fmt; \
^
/home/sergio/mediatek_mt7610u_sta_driver_linux-64bit/include/os/rt_linux.h:664:33: note: in expansion of macro ‘DBGPRINT_RAW’
#define DBGPRINT(Level, Fmt) DBGPRINT_RAW(Level, Fmt)
^
/home/sergio/mediatek_mt7610u_sta_driver_linux-64bit/os/linux/../../common/rtmp_init.c:716:3: note: in expansion of macro ‘DBGPRINT’
DBGPRINT(RT_DEBUG_TRACE,("E2PROM: A Tssi[-4 .. +4] = %d %d %d %d - %d -%d %d
^
/home/sergio/mediatek_mt7610u_sta_driver_linux-64bit/include/os/rt_linux.h:660:9: warning: array subscript is above array bounds [-Warray-bounds]
printk Fmt; \
^
/home/sergio/mediatek_mt7610u_sta_driver_linux-64bit/include/os/rt_linux.h:664:33: note: in expansion of macro ‘DBGPRINT_RAW’
#define DBGPRINT(Level, Fmt) DBGPRINT_RAW(Level, Fmt)
^
/home/sergio/mediatek_mt7610u_sta_driver_linux-64bit/os/linux/../../common/rtmp_init.c:716:3: note: in expansion of macro ‘DBGPRINT’
DBGPRINT(RT_DEBUG_TRACE,("E2PROM: A Tssi[-4 .. +4] = %d %d %d %d - %d -%d %d
^
CC [M] /home/sergio/mediatek_mt7610u_sta_driver_linux-64bit/os/linux/../../common/rtmp_init_inf.o
CC [M] /home/sergio/mediatek_mt7610u_sta_driver_linux-64bit/os/linux/../../common/cmm_tkip.o
CC [M] /home/sergio/mediatek_mt7610u_sta_driver_linux-64bit/os/linux/../../common/cmm_aes.o
CC [M] /home/sergio/mediatek_mt7610u_sta_driver_linux-64bit/os/linux/../../common/cmm_sync.o
CC [M] /home/sergio/mediatek_mt7610u_sta_driver_linux-64bit/os/linux/../../common/eeprom.o
CC [M] /home/sergio/mediatek_mt7610u_sta_driver_linux-64bit/os/linux/../../common/cmm_sanity.o
CC [M] /home/sergio/mediatek_mt7610u_sta_driver_linux-64bit/os/linux/../../common/cmm_info.o
In file included from /home/sergio/mediatek_mt7610u_sta_driver_linux-64bit/include/rtmp_os.h:44:0,
from /home/sergio/mediatek_mt7610u_sta_driver_linux-64bit/include/rtmp_comm.h:75,
from /home/sergio/mediatek_mt7610u_sta_driver_linux-64bit/include/rt_config.h:33,
from /home/sergio/mediatek_mt7610u_sta_driver_linux-64bit/os/linux/../../common/cmm_info.c:28:
/home/sergio/mediatek_mt7610u_sta_driver_linux-64bit/os/linux/../../common/cmm_info.c: In function ‘Set_DebugFunc_Proc’:
/home/sergio/mediatek_mt7610u_sta_driver_linux-64bit/os/linux/../../common/cmm_info.c:1084:30: warning: format ‘%x’ expects argument of type ‘unsigned int’, but argument 2 has type ‘ULONG {aka long unsigned int}’ [-Wformat=]
DBGPRINT_S(RT_DEBUG_TRACE, ("Set RTDebugFunc = 0x%x\n", RTDebugFunc));
^
/home/sergio/mediatek_mt7610u_sta_driver_linux-64bit/include/os/rt_linux.h:675:9: note: in definition of macro ‘DBGPRINT_S’
printk Fmt; \
^
/home/sergio/mediatek_mt7610u_sta_driver_linux-64bit/os/linux/../../common/cmm_info.c: In function ‘set_rf’:
/home/sergio/mediatek_mt7610u_sta_driver_linux-64bit/os/linux/../../common/cmm_info.c:5960:20: warning: format ‘%x’ expects argument of type ‘unsigned int *’, but argument 5 has type ‘UCHAR * {aka unsigned char *}’ [-Wformat=]
rv = sscanf(arg, "%d-%d-%x", &(bank_id), &(rf_id), &(rf_val));
^
CC [M] /home/sergio/mediatek_mt7610u_sta_driver_linux-64bit/os/linux/../../common/cmm_cfg.o
/home/sergio/mediatek_mt7610u_sta_driver_linux-64bit/os/linux/../../common/cmm_cfg.c: In function ‘RTMP_COM_IoctlHandle’:
/home/sergio/mediatek_mt7610u_sta_driver_linux-64bit/os/linux/../../common/cmm_cfg.c:705:32: warning: unused variable ‘ppINTF’ [-Wunused-variable]
VOID **ppINTF = (VOID **)pData;
^
CC [M] /home/sergio/mediatek_mt7610u_sta_driver_linux-64bit/os/linux/../../common/cmm_wpa.o
CC [M] /home/sergio/mediatek_mt7610u_sta_driver_linux-64bit/os/linux/../../common/cmm_radar.o
CC [M] /home/sergio/mediatek_mt7610u_sta_driver_linux-64bit/os/linux/../../common/spectrum.o
In file included from /home/sergio/mediatek_mt7610u_sta_driver_linux-64bit/include/rtmp_os.h:44:0,
from /home/sergio/mediatek_mt7610u_sta_driver_linux-64bit/include/rtmp_comm.h:75,
from /home/sergio/mediatek_mt7610u_sta_driver_linux-64bit/include/rt_config.h:33,
from /home/sergio/mediatek_mt7610u_sta_driver_linux-64bit/os/linux/../../common/spectrum.c:28:
/home/sergio/mediatek_mt7610u_sta_driver_linux-64bit/os/linux/../../common/spectrum.c: In function ‘PeerMeasureReportAction’:
/home/sergio/mediatek_mt7610u_sta_driver_linux-64bit/os/linux/../../common/spectrum.c:1972:29: warning: format ‘%d’ expects argument of type ‘int’, but argument 3 has type ‘long unsigned int’ [-Wformat=]
DBGPRINT(RT_DEBUG_ERROR, ("%s unable to alloc memory for measure report buffe
^
/home/sergio/mediatek_mt7610u_sta_driver_linux-64bit/include/os/rt_linux.h:660:16: note: in definition of macro ‘DBGPRINT_RAW’
printk Fmt; \
^
/home/sergio/mediatek_mt7610u_sta_driver_linux-64bit/os/linux/../../common/spectrum.c:1972:3: note: in expansion of macro ‘DBGPRINT’
DBGPRINT(RT_DEBUG_ERROR, ("%s unable to alloc memory for measure report buffe
^
CC [M] /home/sergio/mediatek_mt7610u_sta_driver_linux-64bit/os/linux/../../common/rtmp_timer.o
CC [M] /home/sergio/mediatek_mt7610u_sta_driver_linux-64bit/os/linux/../../common/rt_channel.o
CC [M] /home/sergio/mediatek_mt7610u_sta_driver_linux-64bit/os/linux/../../common/cmm_profile.o
CC [M] /home/sergio/mediatek_mt7610u_sta_driver_linux-64bit/os/linux/../../common/cmm_asic.o
/home/sergio/mediatek_mt7610u_sta_driver_linux-64bit/os/linux/../../common/cmm_asic.c: In function ‘AsicUpdateProtect’:
/home/sergio/mediatek_mt7610u_sta_driver_linux-64bit/os/linux/../../common/cmm_asic.c:330:21: warning: large integer implicitly truncated to unsigned type [-Woverflow]
UCHAR i, PhyMode = 0x4000;
^
/home/sergio/mediatek_mt7610u_sta_driver_linux-64bit/os/linux/../../common/cmm_asic.c:384:12: warning: large integer implicitly truncated to unsigned type [-Woverflow]
PhyMode = 0x2000; /* Bit 15:13, 0:Legacy CCK, 1: Legacy OFDM, 2: HT mix mode,
^
CC [M] /home/sergio/mediatek_mt7610u_sta_driver_linux-64bit/os/linux/../../common/scan.o
CC [M] /home/sergio/mediatek_mt7610u_sta_driver_linux-64bit/os/linux/../../common/cmm_cmd.o
CC [M] /home/sergio/mediatek_mt7610u_sta_driver_linux-64bit/os/linux/../../common/uapsd.o
CC [M] /home/sergio/mediatek_mt7610u_sta_driver_linux-64bit/os/linux/../../common/ps.o
CC [M] /home/sergio/mediatek_mt7610u_sta_driver_linux-64bit/os/linux/../../rate_ctrl/ra_ctrl.o
CC [M] /home/sergio/mediatek_mt7610u_sta_driver_linux-64bit/os/linux/../../rate_ctrl/alg_legacy.o
CC [M] /home/sergio/mediatek_mt7610u_sta_driver_linux-64bit/os/linux/../../rate_ctrl/alg_ags.o
CC [M] /home/sergio/mediatek_mt7610u_sta_driver_linux-64bit/os/linux/../../chips/rtmp_chip.o
/home/sergio/mediatek_mt7610u_sta_driver_linux-64bit/os/linux/../../chips/rtmp_chip.c: In function ‘RtmpChipOpsHook’:
/home/sergio/mediatek_mt7610u_sta_driver_linux-64bit/os/linux/../../chips/rtmp_chip.c:910:30: error: assignment from incompatible pointer type [-Werror=incompatible-pointer-types]
pChipOps->ChipSwitchChannel = Default_ChipSwitchChannel;
^
cc1: some warnings being treated as errors
scripts/Makefile.build:308: ошибка выполнения рецепта для цели «/home/sergio/mediatek_mt7610u_sta_driver_linux-64bit/os/linux/../../chips/rtmp_chip.o»
make[2]: *** [/home/sergio/mediatek_mt7610u_sta_driver_linux-64bit/os/linux/../../chips/rtmp_chip.o] Ошибка 1
Makefile:1550: ошибка выполнения рецепта для цели «_module_/home/sergio/mediatek_mt7610u_sta_driver_linux-64bit/os/linux»
make[1]: *** [_module_/home/sergio/mediatek_mt7610u_sta_driver_linux-64bit/os/linux] Ошибка 2
make[1]: выход из каталога «/usr/src/linux-headers-4.13.0-26-generic»
Makefile:393: ошибка выполнения рецепта для цели «LINUX»
make: *** [LINUX] Ошибка 2
sergio@sergio-MS-7996 ~/mediatek_mt7610u_sta_driver_linux-64bit $ sudo make install
[sudo] пароль для sergio:
make -C /home/sergio/mediatek_mt7610u_sta_driver_linux-64bit/os/linux -f Makefile.6 install
make[1]: вход в каталог «/home/sergio/mediatek_mt7610u_sta_driver_linux-64bit/os/linux»
rm -rf /etc/Wireless/RT2870STA
mkdir /etc/Wireless/RT2870STA
cp /home/sergio/mediatek_mt7610u_sta_driver_linux-64bit/conf/RT2870STA.dat /etc/Wireless/RT2870STA/.
install -d /lib/modules/4.13.0-26-generic/kernel/drivers/net/wireless/
install -m 644 -c mt7610u_sta.ko /lib/modules/4.13.0-26-generic/kernel/drivers/net/wireless/
install: не удалось выполнить stat для 'mt7610u_sta.ko': Нет такого файла или каталога
Makefile.6:454: ошибка выполнения рецепта для цели «install»
make[1]: *** [install] Ошибка 1
make[1]: выход из каталога «/home/sergio/mediatek_mt7610u_sta_driver_linux-64bit/os/linux»
Makefile:489: ошибка выполнения рецепта для цели «install»
make: *** [install] Ошибка 2


Автор темы
sergio
Сообщения: 16
Зарегистрирован: 17 янв 2018, 05:50
Благодарил (а): 4 раза

Не работает Wi-Fi адаптер TP-Link Archer T1U

Сообщение sergio » 19 янв 2018, 06:51

Видимо не понимаю что делаю.


Автор темы
sergio
Сообщения: 16
Зарегистрирован: 17 янв 2018, 05:50
Благодарил (а): 4 раза

Не работает Wi-Fi адаптер TP-Link Archer T1U

Сообщение sergio » 19 янв 2018, 06:56

Unborn,
Есть ещё универсальный rtl8812au-dkms
.
Где он лежит?

Аватара пользователя

Unborn
Сообщения: 1775
Зарегистрирован: 03 сен 2016, 10:36
Решено: 24
Благодарил (а): 4 раза
Поблагодарили: 252 раза

Не работает Wi-Fi адаптер TP-Link Archer T1U

Сообщение Unborn » 19 янв 2018, 07:41

sergio писал(а):
19 янв 2018, 06:51
Попробовал выполнить так как написано тут http://hprath.com/2014/06/cisco-linksys ... ver-patch/. Но не помогло.
А у тебя что - ID 13b1:003e Linksys? У тебя - ID 2357:0105
Ещё раз -
Unborn писал(а):
17 янв 2018, 11:27
Ты mt7610u-dkms пробовал установить? Что получилось?
sergio писал(а):
19 янв 2018, 06:56
Где он лежит?
В Гугле что-ли забанили? Для ядра 4.13 на гите - https://github.com/zebulon2/rtl8812au-driver-5.2.9 исходники.
https://packages.ubuntu.com/search?keyw ... 812au-dkms
Но, говорят, что для ядра 4.13 версия 4.3.8 не собирается. Я х.з. у меня нет этого свистка, чтобы проверить.
Пробуй последовательно с mt7610u-dkms.


Автор темы
sergio
Сообщения: 16
Зарегистрирован: 17 янв 2018, 05:50
Благодарил (а): 4 раза

Не работает Wi-Fi адаптер TP-Link Archer T1U

Сообщение sergio » 19 янв 2018, 09:43

Unborn, по вашей ссылке:
sudo add-apt-repository ppa:hanipouspilot/rtlwifi
sudo apt update
sudo apt install mt7610u-dkms

Получаю такой вывод:
sergio@sergio-MS-7996 ~ $ sudo apt install mt7610u-dkms
Чтение списков пакетов… Готово
Построение дерева зависимостей
Чтение информации о состоянии… Готово
НОВЫЕ пакеты, которые будут установлены:
mt7610u-dkms
обновлено 0, установлено 1 новых пакетов, для удаления отмечено 0 пакетов, и 0 пакетов не обновлено.
Необходимо скачать 1 012 kБ архивов.
После данной операции, объём занятого дискового пространства возрастёт на 8 576 kB.
Пол:1 http://ppa.launchpad.net/hanipouspilot/rtlwifi/ubuntu xenial/main amd64 mt7610u-dkms all 0.2 [1 012 kB]
Получено 1 012 kБ за 1с (898 kБ/c)
Выбор ранее не выбранного пакета mt7610u-dkms.
(Чтение базы данных … на данный момент установлено 250227 файлов и каталогов.)
Подготовка к распаковке …/mt7610u-dkms_0.2_all.deb …
Распаковывается mt7610u-dkms (0.2) …
Настраивается пакет mt7610u-dkms (0.2) …
Loading new mt7610u-0.2 DKMS files...
First Installation: checking all kernels...
Building only for 4.13.0-26-generic
Building for architecture amd64
Building initial module for 4.13.0-26-generic
ERROR (dkms apport): kernel package linux-headers-4.13.0-26-generic is not supported
Error! Bad return status for module build on kernel: 4.13.0-26-generic (amd64)
Consult /var/lib/dkms/mt7610u/0.2/build/make.log for more information.
Далее что написано в этом логе:
DKMS make.log for mt7610u-0.2 for kernel 4.13.0-26-generic (amd64)
Пт янв 19 13:29:24 +04 2018
make -C tools
make[1]: вход в каталог «/var/lib/dkms/mt7610u/0.2/build/tools»
gcc -g bin2h.c -o bin2h
make[1]: выход из каталога «/var/lib/dkms/mt7610u/0.2/build/tools»
/var/lib/dkms/mt7610u/0.2/build/tools/bin2h
chipset = mt7610u
cp -f os/linux/Makefile.6 /var/lib/dkms/mt7610u/0.2/build/os/linux/Makefile
make -C /lib/modules/4.13.0-26-generic/build SUBDIRS=/var/lib/dkms/mt7610u/0.2/build/os/linux modules
make[1]: вход в каталог «/usr/src/linux-headers-4.13.0-26-generic»
CC [M] /var/lib/dkms/mt7610u/0.2/build/os/linux/../../os/linux/rt_profile.o
In file included from /var/lib/dkms/mt7610u/0.2/build/include/rtmp_os.h:44:0,
from /var/lib/dkms/mt7610u/0.2/build/include/rtmp_comm.h:75,
from /var/lib/dkms/mt7610u/0.2/build/include/rt_config.h:33,
from /var/lib/dkms/mt7610u/0.2/build/os/linux/../../os/linux/rt_profile.c:28:
/var/lib/dkms/mt7610u/0.2/build/include/os/rt_linux.h:77:0: warning: "EXT_BUILD_CHANNEL_LIST" redefined
#define EXT_BUILD_CHANNEL_LIST /* must define with CRDA */
^
<command-line>:0:0: note: this is the location of the previous definition
In file included from /var/lib/dkms/mt7610u/0.2/build/include/os/rt_linux.h:98:0,
from /var/lib/dkms/mt7610u/0.2/build/include/rtmp_os.h:44,
from /var/lib/dkms/mt7610u/0.2/build/include/rtmp_comm.h:75,
from /var/lib/dkms/mt7610u/0.2/build/include/rt_config.h:33,
from /var/lib/dkms/mt7610u/0.2/build/os/linux/../../os/linux/rt_profile.c:28:
/var/lib/dkms/mt7610u/0.2/build/include/cfg80211.h:35:49: error: ‘IEEE80211_NUM_BANDS’ undeclared here (not in a function)
struct ieee80211_supported_band Cfg80211_bands[IEEE80211_NUM_BANDS];
^
/var/lib/dkms/mt7610u/0.2/build/os/linux/../../os/linux/rt_profile.c: In function ‘announce_802_3_packet’:
/var/lib/dkms/mt7610u/0.2/build/os/linux/../../os/linux/rt_profile.c:341:16: warning: unused variable ‘pAd’ [-Wunused-variable]
RTMP_ADAPTER *pAd = (RTMP_ADAPTER *)pAdSrc;
^
In file included from /var/lib/dkms/mt7610u/0.2/build/include/rtmp_os.h:44:0,
from /var/lib/dkms/mt7610u/0.2/build/include/rtmp_comm.h:75,
from /var/lib/dkms/mt7610u/0.2/build/include/rt_config.h:33,
from /var/lib/dkms/mt7610u/0.2/build/os/linux/../../os/linux/rt_profile.c:28:
/var/lib/dkms/mt7610u/0.2/build/os/linux/../../os/linux/rt_profile.c: In function ‘STA_MonPktSend’:
/var/lib/dkms/mt7610u/0.2/build/os/linux/../../os/linux/rt_profile.c:450:35: warning: format ‘%d’ expects argument of type ‘int’, but argument 3 has type ‘long unsigned int’ [-Wformat=]
DBGPRINT(RT_DEBUG_ERROR, ("%s : Size is too large! (%d)\n", __FUNCTION__, pRxBlk->DataSize + sizeof(wlan_ng_prism2_header)));
^
/var/lib/dkms/mt7610u/0.2/build/include/os/rt_linux.h:669:16: note: in definition of macro ‘DBGPRINT_RAW’
printk Fmt; \
^
/var/lib/dkms/mt7610u/0.2/build/os/linux/../../os/linux/rt_profile.c:450:9: note: in expansion of macro ‘DBGPRINT’
DBGPRINT(RT_DEBUG_ERROR, ("%s : Size is too large! (%d)\n", __FUNCTION__, pRxBlk->DataSize + sizeof(wlan_ng_prism2_header)));
^
scripts/Makefile.build:308: ошибка выполнения рецепта для цели «/var/lib/dkms/mt7610u/0.2/build/os/linux/../../os/linux/rt_profile.o»
make[2]: *** [/var/lib/dkms/mt7610u/0.2/build/os/linux/../../os/linux/rt_profile.o] Ошибка 1
Makefile:1550: ошибка выполнения рецепта для цели «_module_/var/lib/dkms/mt7610u/0.2/build/os/linux»
make[1]: *** [_module_/var/lib/dkms/mt7610u/0.2/build/os/linux] Ошибка 2
make[1]: выход из каталога «/usr/src/linux-headers-4.13.0-26-generic»
Makefile:403: ошибка выполнения рецепта для цели «LINUX»
make: *** [LINUX] Ошибка 2

Аватара пользователя

Unborn
Сообщения: 1775
Зарегистрирован: 03 сен 2016, 10:36
Решено: 24
Благодарил (а): 4 раза
Поблагодарили: 252 раза

Не работает Wi-Fi адаптер TP-Link Archer T1U

Сообщение Unborn » 19 янв 2018, 11:16

sergio, в принципе, ожидаемо, что dkms не собрался. На удачу это было. Собирай из исходников с гита версию rtl8812au, но тоже не факт.
Неудачно для Линукс ты свисток приобрел. В десктоп мог бы и нормальную дискретную вафлю купить. Интеловскую или Атерос.


Автор темы
sergio
Сообщения: 16
Зарегистрирован: 17 янв 2018, 05:50
Благодарил (а): 4 раза

Не работает Wi-Fi адаптер TP-Link Archer T1U

Сообщение sergio » 20 янв 2018, 05:30

Unborn, да, вот ага. Поторопился :sad: . Нужно было для начала почитать и поискать инфу про различные адаптеры.


Автор темы
sergio
Сообщения: 16
Зарегистрирован: 17 янв 2018, 05:50
Благодарил (а): 4 раза

Не работает Wi-Fi адаптер TP-Link Archer T1U

Сообщение sergio » 20 янв 2018, 06:07

Проблема в том что не так много адаптеров, работающих в диапазоне 5ГГц. Собственно из-за этого только и брал такой адаптер.

Аватара пользователя

Unborn
Сообщения: 1775
Зарегистрирован: 03 сен 2016, 10:36
Решено: 24
Благодарил (а): 4 раза
Поблагодарили: 252 раза

Не работает Wi-Fi адаптер TP-Link Archer T1U

Сообщение Unborn » 20 янв 2018, 07:52

sergio писал(а):
20 янв 2018, 06:07
Проблема в том что не так много адаптеров, работающих в диапазоне 5ГГц. Собственно из-за этого только и брал такой адаптер.
Лучше канал на 2.4 посвободнее поищи. 5 дома использовать если только роутер в буквальном смысле под боком.

Вернуться в «Сетевые карты, модемы, Wi-Fi, bluetooth»